Welcome Guest.

1Answers

Maven’s problems when integrating mms have not been able to run

Asked by: Lisa 241 views IT June 3, 2018

[INFO] exam-manager ....................................... SUCCESS [  0.784 s]

[INFO] exam-manager-pojo .................................. SUCCESS [  4.183 s]

[INFO] exam-manager-dao ................................... SUCCESS [  1.007 s]

[INFO] exam-manager-interface ............................. SUCCESS [  0.269 s]

[INFO] exam-manager-service ............................... FAILURE [  1.312 s]

[INFO] exam-manager-web ................................... SKIPPED

[INFO] ------------------------------------------------------------------------

[INFO] BUILD FAILURE

[INFO] ------------------------------------------------------------------------

[INFO] Total time: 7.836 s

[INFO] Finished at: 2018-06-03T19:42:56+08:00

[INFO] Final Memory: 28M/220M

[INFO] ------------------------------------------------------------------------

[ERROR] Failed to execute goal org.apache.maven.plugins:maven-compiler-plugin:3.2:compile (default-compile) on project exam-manager-service: Compilation failure: Compilation failure:

[ERROR] /D:/Myworks/example03/exam-manager/exam-manager-service/src/main/java/cn/e3mall/pagehelper/PageHelperTest.java:[5,17] 程序包org.junit不存在

[ERROR] /D:/Myworks/example03/exam-manager/exam-manager-service/src/main/java/cn/e3mall/pagehelper/PageHelperTest.java:[18,18] 找不到符号

[ERROR] 符号:   类 Test

[ERROR] 位置: 类 cn.e3mall.pagehelper.PageHelperTest

[ERROR] -> [Help 1]

[ERROR] 

[ERROR] To see the full stack trace of the errors, re-run Maven with the -e switch.

[ERROR] Re-run Maven using the -X switch to enable full debug logging.

[ERROR] 

[ERROR] For more information about the errors and possible solutions, please read the following articles:

[ERROR] [Help 1] http://cwiki.apache.org/confluence/display/MAVEN/MojoFailureException

[ERROR] 

[ERROR] After correcting the problems, you can resume the build with the command

[ERROR]   mvn <goals> -rf :exam-manager-service

1 Answers

  1. +1Votes  

    It should be a program running to load data error

    Arthur White- June 3, 2018 |